BDBM50319986 CHEMBL1085743::N-(3,3-bis(4-fluorophenyl)propyl)-3-(pyrazin-2-yl)pyrrolidine-1-carboxamide
SMILES Fc1ccc(cc1)C(CCNC(=O)N1CCC(C1)c1cnccn1)c1ccc(F)cc1
InChI Key InChIKey=SHGFMISVWSSDPI-UHFFFAOYSA-N
Data  3 IC50
  Tab Delimited (TSV)   2D SDfile   Computed 3D by Vconf -m prep SDfile
Find this compound or compounds like it in BindingDB:
Activity Spreadsheet -- Enzyme Inhibition Constant Data from BindingDB
Found 2 hits for monomerid = 50319986
TargetBifunctional epoxide hydrolase 2(Homo sapiens (Human))
Boehringer Ingelheim Pharmaceuticals
Curated by ChEMBL
LigandPNGBDBM50319986(CHEMBL1085743 | N-(3,3-bis(4-fluorophenyl)propyl)-...)
Affinity DataIC50:  4nM. Assay description: Inhibition of human soluble epoxide hydrolase assessed as [2-3H]-trans-1,3-diphenyl propylene oxide hydrolysis by cellular assay
In DepthDetails ArticlePubMed
TargetBifunctional epoxide hydrolase 2(Homo sapiens (Human))
Boehringer Ingelheim Pharmaceuticals
Curated by ChEMBL
LigandPNGBDBM50319986(CHEMBL1085743 | N-(3,3-bis(4-fluorophenyl)propyl)-...)
Affinity DataIC50:  3nM. Assay description: Inhibition of human soluble epoxide hydrolase
In DepthDetails ArticlePubMed